{"text_format":"1","workbook":"xlsx","n_sheets":5,"sheets":["Guide & Calcul des primes","Procédure + détails avec audit","Procédure + détails sans audit","Informations supplémentaires","Building Blocks (BB)"],"not_rendered":{"charts":0,"images":11,"macros":1,"external_links":0,"defined_names":19,"comments":0,"pivot_tables":0},"unopened":[],"bounds":{"document_bytes":16777216,"sheet_cells":100000,"rows_first":2000,"rows_last":500,"rows_between":2000,"halvings":0,"cell_chars":16384,"cell_head_chars":4096},"cells_cut":0,"cells_raw":0,"read":"whole","date_system":"1900"}

{"sheet":"Guide & Calcul des primes","index":0,"n_rows":92,"n_cols":12,"rows_kept":92,"cut":false,"hidden":false,"merged":[[4,2,4,7],[20,4,20,11],[20,2,20,3],[2,1,2,8],[5,6,5,7],[6,6,6,7],[7,6,7,7],[8,6,8,7],[5,2,5,5],[18,1,19,1],[18,4,19,5],[18,6,19,11],[18,2,19,3],[6,2,6,5],[7,2,7,5],[8,2,8,5],[9,2,9,5],[10,2,10,5],[14,6,16,11],[16,4,16,5],[9,6,9,7],[14,4,14,5],[12,2,12,5],[14,2,14,3],[16,2,16,3]]}
[]
[]
[null,"Outil d'estimation rapide des primes à la rénovation de la région wallonne"]
[]
[null,1,"Déterminer le régime des revenus du ménage afin d'obtenir l'indice de majoration des primes du demandeur :"]
[null,null,"Somme des revenus annuels imposables globaux du ménage   →",null,null,null,{"$f":"40000+35000","v":75000}]
[null,null,"Nombre d'enfants à charge  (existant, à naître, orphelin ou en hébergement égalitaire)   →",null,null,null,2]
[null,null,"Nombre de personnes présentant un handicap et faisant partie du ménage   →",null,null,null,0]
[null,null,"Nombre de parents-cohabitants de plus de 60 ans   →",null,null,null,0]
[null,null,"Revenu de référence du ménage   →",null,null,null,{"$f":"G6-G7*5000-G8*5000-G9*5000","v":65000}]
[null,null,"Régime de majoration des primes du demandeur   →",null,null,null,{"$f":"IF(G10<='Informations supplémentaires'!$E$9,'Informations supplémentaires'!C9,IF(G10<='Informations supplémentaires'!E10,'Informations supplémentaires'!C10,IF(G10<='Informations supplémentaires'!E11,'Informations supplémentaires'!C11,IF(G10<='Informations supplémentaires'!E12,'Informations supplémentaires'!C12,IF(G10>'Informations supplémentaires'!E12,'Informations supplémentaires'!C13,\"erreur\")))))","v":"R4"},{"$f":"VLOOKUP($G$11,'Informations supplémentaires'!$C$9:$F$13,4)","v":2}]
[]
[null,2,"Indiquer les quantités spécifiques à votre projet de rénovation dans le tableau ci-dessous"]
[]
[null,3,"Allez-vous faire appel à un auditeur Logement ?                            →  Auditeur ?                ",null,"oui",null,{"$f":"IF(AND(E15=\"oui\",E17=\"le demandeur\"),\"Attention :   \nle demandeur ne peut pas réaliser les travaux lui-même pour obtenir les primes Habitation, \nseules les primes toitures et les primes pour petits travaux lui seront accessibles !\",IF(E15=\"oui\",\"Attention :\nLe passage préalable d'un AUDITEUR LOGEMENT est nécessaire pour l'obtention de prime(s) Habitation\",IF(E15=\"non\",IF((H30+H31+H32+H37+H38+H39+H45+H80+H82+H83+H84+H85+H86+H87+H88)>0,\"Attention :\nLe passage préalable d'un ESTIMATEUR DU SPW est nécessaire pour l'obtention d'une ou plusieurs primes activées ci-dessous\",\"\"))))","v":"Attention :\nLe passage préalable d'un AUDITEUR LOGEMENT est nécessaire pour l'obtention de prime(s) Habitation"}]
{"$rows_left_out":78}
{"sheet":"Procédure + détails avec audit","index":1,"n_rows":63,"n_cols":3,"rows_kept":63,"cut":false,"hidden":false,"merged":[[13,1,13,2],[14,1,14,2],[15,1,15,2],[16,1,16,2],[2,1,2,2],[17,1,17,2],[18,1,18,2],[19,1,19,2],[20,1,20,2],[22,1,22,2],[40,1,40,2],[34,1,34,2],[23,1,23,2],[24,1,24,2],[25,1,25,2],[27,1,27,2],[26,1,26,2],[28,1,28,2],[29,1,29,2],[30,1,30,2],[31,1,31,2],[32,1,32,2],[33,1,33,2],[35,1,35,2],[36,1,36,2],[37,1,37,2],[38,1,38,2],[39,1,39,2],[58,1,58,2],[59,1,59,2],[41,1,41,2],[42,1,42,2],[43,1,43,2],[44,1,44,2],[51,1,51,2],[52,1,52,2],[53,1,53,2],[54,1,54,2],[57,1,57,2],[55,1,55,2],[56,1,56,2],[46,1,46,2],[100,1,100,2],[99,1,99,2],[47,1,47,2],[48,1,48,2],[49,1,49,2],[50,1,50,2],[63,1,63,2],[62,1,62,2],[60,1,60,2],[61,1,61,2]]}
[]
[]
[null,"Sources   →   Primes Habitation   →   avec audit"]
[null,"Portail Wallonie - SPW (formulaires de demandes et annexes techniques en bas de page)  →","https://energie.wallonie.be/fr/primes-habitation-a-partir-du-1er-juillet-2023.html?IDC=10441"]
[null,"Critères techniques et pièces justificatives  →","https://energie.wallonie.be/servlet/Repository/75370.pdf?ID=75370"]
[null,"Brochure  →","https://energie.wallonie.be/servlet/Repository/76517.pdf?ID=76517"]
[null,"Liste des isolants biosourcés éligibles aux primes  →","https://energie.wallonie.be/servlet/Repository/61079.pdf?ID=61079"]
[null,"Liste des PAC ECS (pompes à chaleur eau chaude sanitaire) éligibles aux primes  →","https://energie.wallonie.be/servlet/Repository/58630.pdf?ID=58630"]
[null,"Liste des PAC (pompes à chaleur) chauffage éligibles aux primes  →","https://energie.wallonie.be/servlet/Repository/58631.pdf?ID=58631"]
[null,"Liste des poêles biomasse éligibles aux primes  →","https://energie.wallonie.be/servlet/Repository/58359.pdf?ID=58359"]
[null,"Liste des chaudières biomasse éligibles aux primes  →","https://energie.wallonie.be/servlet/Repository/58007.pdf?ID=58007"]
[null,"Circulaire des travaux pris en compte pour l'octroi d'une prime  →","https://energie.wallonie.be/servlet/Repository/78156.pdf?ID=78156"]
[]
[null,"Points d'attention   →   Primes Habitation   →   avec audit"]
[null,"Le montant de la prime ne sera pas supérieur à 90% du montant TVAC des postes éligibles des factures, sauf dans le cas des travaux liés.\nLe montant de base de la prime peut être multiplié par 1, 2, 3, 4 ou 6 en fonction de vos revenus et de la composition de votre ménage (régime du ménage). "]
{"$rows_left_out":49}
{"sheet":"Procédure + détails sans audit","index":2,"n_rows":51,"n_cols":3,"rows_kept":51,"cut":false,"hidden":false,"merged":[[12,1,12,2],[13,1,13,2],[14,1,14,2],[15,1,15,2],[2,1,2,2],[10,1,10,2],[11,1,11,2],[26,1,26,2],[27,1,27,2],[19,1,19,2],[20,1,20,2],[21,1,21,2],[22,1,22,2],[23,1,23,2],[66,1,66,2],[67,1,67,2],[16,1,16,2],[17,1,17,2],[31,1,31,2],[34,1,34,2],[33,1,33,2],[28,1,28,2],[29,1,29,2],[30,1,30,2],[32,1,32,2],[36,1,36,2],[35,1,35,2],[24,1,24,2],[38,1,38,2],[25,1,25,2],[39,1,39,2],[40,1,40,2],[41,1,41,2],[42,1,42,2],[44,1,44,2],[43,1,43,2],[50,1,50,2],[45,1,45,2],[49,1,49,2],[46,1,46,2],[47,1,47,2],[48,1,48,2]]}
[]
[]
[null,"Sources   →   Primes Toitures et petits travaux   →   sans audit"]
[null,"Portail Wallonie - SPW (formulaires de demandes et annexes techniques en bas de page)  →","https://energie.wallonie.be/fr/prime-toiture-et-petits-travaux-sans-audit.html?IDC=10305#"]
[null,"Critères techniques et pièces justificatives  →","https://energie.wallonie.be/servlet/Repository/75531.pdf?ID=75531"]
[null,"Guide pratique  →","https://energie.wallonie.be/servlet/Repository/72865.pdf?ID=72865"]
[null,"Liste des isolants biosourcés éligibles aux primes  →","https://energie.wallonie.be/servlet/Repository/61079.pdf?ID=61079"]
[null,"Liste des PAC ECS (pompes à chaleur eau chaude sanitaire) éligibles aux primes  → ","https://energie.wallonie.be/servlet/Repository/58630.pdf?ID=58630"]
[null,"Circulaire des travaux pris en compte pour l'octroi d'une prime  →","https://energie.wallonie.be/servlet/Repository/78156.pdf?ID=78156"]
[]
[null,"Points d'attention   →   Primes Toitures et petits travaux   →   sans audit"]
[null,"Certains travaux requièrent une visite préalable d'un estimateur du SPW Logement. \nNe commencez pas vos travaux avant cette visite si celle-ci est requise (formulaire de demande de passage d'un estimateur disponible via le portail du SPW ci-dessus)."]
[null,"Vous pouvez réaliser certains travaux vous-même, d'autres doivent être réalisés par un entrepreneur inscrit auprès de la Banque-Carrefour des Entreprises, ayant les accès à la profession."]
[null,"Tous les 24 mois, vous pouvez solliciter une prime pour la réalisation de 5 travaux de rénovation et 5 travaux d'amélioration de la performance énergétique."]
[null,"Excepté pour les travaux relatifs à la toiture, le montant des factures des postes éligibles est obligatoirement supérieur à 200€ et inférieur ou égal à 6000€ TVAC.\nSi vous réalisez plusieurs travaux, ce plafond ne s'applique pas au total des factures des travaux mais bien pour chaque poste de travaux repris dans la liste expliquant le montant des primes.\nLe montant des primes ne sera pas supérieur à 90 % du montant des factures TVAC de chaque poste de travaux."]
{"$rows_left_out":37}
{"sheet":"Informations supplémentaires","index":3,"n_rows":21,"n_cols":6,"rows_kept":21,"cut":false,"hidden":false,"merged":[[16,1,16,5],[17,1,17,5],[18,1,18,5],[19,1,19,5],[20,1,20,5],[15,1,15,5],[2,1,2,5],[3,2,3,3],[4,2,4,3],[5,2,5,3],[13,1,13,5],[8,1,12,1],[3,4,3,5],[4,4,4,5],[5,4,5,5]]}
[]
[]
[null,"Calculer l'épaisseur de chaque type d'isolant afin d'atteindre l'objectif d'obtention des primes"]
[null,null,"Valeur lambda de l'isolant  (λ)   →",null,0.04]
[null,null,"Résistance thermique à atteindre  (R)   →",null,5]
[null,null,"Epaisseur isolant minimum nécessaire  →",null,{"$f":"ROUND(E4*E5*100,1)","v":20}]
[]
[null,"Calcul du revenu de référence du ménage","Régime\n( R )","Revenu de référence du ménage\nà partir du 1er janvier 2023\nsupérieur ou égal à","Revenu de référence du ménage\nà partir du 1er janvier 2023\ninférieur ou égal à","Coefficient de majoration des primes de base"]
[null,"Somme des revenus imposables globaux du ménage ...\n\n          diminué de 5.000,00€ par enfant à charge (existant, à naître, orphelin ou en hébergement égalitaire)\n\n          diminué de 5.000,00€ par personne représentant un handicap et faisant partie du ménage\n\n          diminué de 5.000,00€ par parent-cohabitant de plus de 60 ans","R1",0,24600,6]
[null,null,"R2",24600.01,34900,4]
[null,null,"R3",34900.01,46200,3]
[null,null,"R4",46200.01,104400,2]
[null,null,"R5",104400.01,null,1]
[null,"Attention la majoration de la prime ne concerne pas les associations de copropriétaires. Ces dernières bénéficieront de la prime de base (catégorie de revenus R5)."]
[]
{"$rows_left_out":7}
{"sheet":"Building Blocks (BB)","index":4,"n_rows":14,"n_cols":58,"rows_kept":14,"cut":false,"hidden":true,"merged":[[1,46,1,57],[1,40,1,43],[1,44,1,45],[1,3,1,8],[1,9,1,13],[1,20,1,24],[1,25,1,33],[1,34,1,39],[1,14,1,18]]}
[]
[null,"Section →",{"$f":"'Guide & Calcul des primes'!$C$25","v":"AUDIT"},{"$f":"'Guide & Calcul des primes'!$C$27","v":"TOITURE"},null,null,null,null,null,{"$f":"'Guide & Calcul des primes'!$C$34","v":"MURS ET FACADES"},null,null,null,null,{"$f":"'Guide & Calcul des primes'!$C$40","v":"SOLS"},null,null,null,null,{"$f":"'Guide & Calcul des primes'!$C$46","v":"MENUISERIES EXTERIEURES"},{"$f":"'Guide & Calcul des primes'!C48","v":"PRODUCTION EAU CHAUDE"},null,null,null,null,{"$f":"'Guide & Calcul des primes'!C54","v":"CHAUFFAGE - production / distribution / stock"},null,null,null,null,null,null,null,null,{"$f":"'Guide & Calcul des primes'!$C$64","v":"SANITAIRE - production / distribution / stock"},null,null,null,null,null,{"$f":"'Guide & Calcul des primes'!$C$71","v":"VENTILATION"},null,null,null,{"$f":"'Guide & Calcul des primes'!$C$76","v":"CONFORMITE - SECURITE"},null,{"$f":"'Guide & Calcul des primes'!$C$79","v":"SALUBRITE"}]
[null,"Travaux prime →",{"$f":"'Guide & Calcul des primes'!C26","v":"Audit logement"},{"$f":"'Guide & Calcul des primes'!C28","v":"Isolation thermique toiture"},{"$f":"'Guide & Calcul des primes'!C29","v":"Isolation thermique toiture avec matériau biosourcé"},{"$f":"'Guide & Calcul des primes'!C30","v":"Remplacement de la couverture de toiture"},{"$f":"'Guide & Calcul des primes'!C31","v":"Appropriation de la charpente de toiture"},{"$f":"'Guide & Calcul des primes'!C32","v":"Remplacement de dispositifs d'eaux pluviales de toiture"},{"$f":"'Guide & Calcul des primes'!C33","v":"Isolation thermique de toiture - réduction fiscale"},{"$f":"'Guide & Calcul des primes'!C35","v":"Isolation thermique de murs"},{"$f":"'Guide & Calcul des primes'!C36","v":"Isolation avec matériau biosourcé de murs"},{"$f":"'Guide & Calcul des primes'!C37","v":"Assèchement de murs (extérieurs) - par infiltration"},{"$f":"'Guide & Calcul des primes'!C38","v":"Assèchement de murs - humidité ascensionnelle (pied de mur)"},{"$f":"'Guide & Calcul des primes'!C39","v":"Renforcement / reconstruction de murs instables"},{"$f":"'Guide & Calcul des primes'!C41","v":"Isolation thermique de sols"},{"$f":"'Guide & Calcul des primes'!C42","v":"Isolation avec matériau biosourcé de sols"},{"$f":"'Guide & Calcul des primes'!C43","v":"Remplacement de structure porteuse de plancher d'un ou plusieurs locaux"},{"$f":"'Guide & Calcul des primes'!C44","v":"Remplacement des finitions de planchers en cas d'isolation par le haut"},{"$f":"'Guide & Calcul des primes'!C45","v":"Renforcement/reconstruction de supports (gitage, hourdis, …) d'aires de circulation d'un ou plusieurs locaux"},{"$f":"'Guide & Calcul des primes'!C47","v":"Remplacement de menuiseries extérieures (ou vitrages)"},{"$f":"'Guide & Calcul des primes'!C49","v":"Pompe à chaleur - uniquement pour eau chaude sanitaire"},{"$f":"'Guide & Calcul des primes'!C50","v":"Pompe à chaleur - pour chauffage ou combinée"},{"$f":"'Guide & Calcul des primes'!C51","v":"Chaudière biomasse"},{"$f":"'Guide & Calcul des primes'!C52","v":"Poêle biomasse local"},{"$f":"'Guide & Calcul des primes'!C53","v":"Chauffe-eau solaire"},{"$f":"'Guide & Calcul des primes'!C55","v":"Isolation des conduites, gaines et vannes de chauffage hors du volume protégé (caves, garage, extérieur, …)"},{"$f":"'Guide & Calcul des primes'!C56","v":"Circulateurs à vitesse variable - jusqu'à 3 logements"},{"$f":"'Guide & Calcul des primes'!C57","v":"Circulateurs à vitesse variable - à partir de 4 logements"},{"$f":"'Guide & Calcul des primes'!C58","v":"Isolation du ballon de stockage de chauffage - ≤ 500 litres"},{"$f":"'Guide & Calcul des primes'!C59","v":"Isolation du ballon de stockage de chauffage - > 500 litres"},{"$f":"'Guide & Calcul des primes'!C60","v":"Remplacement du ballon de stockage de chauffage - ≤ 500 litres"},{"$f":"'Guide & Calcul des primes'!C61","v":"Remplacement du ballon de stockage de chauffage - > 500 litres"},{"$f":"'Guide & Calcul des primes'!C62","v":"Placement de vannes thermostatiques"},{"$f":"'Guide & Calcul des primes'!C63","v":"Placement d'un thermostat d'ambiance"},{"$f":"'Guide & Calcul des primes'!C65","v":"Isolation d'un ballon de stockage pour l'eau chaude sanitaire < 500 litres"},{"$f":"'Guide & Calcul des primes'!C66","v":"Isolation d'un ballon de stockage pour l'eau chaude sanitaire > 500 litres"},{"$f":"'Guide & Calcul des primes'!C67","v":"Nouveau ballon d'eau chaude sanitaire < 500 litres"},{"$f":"'Guide & Calcul des primes'!C68","v":"Nouveau ballon d'eau chaude sanitaire > 500 litres"},{"$f":"'Guide & Calcul des primes'!C69","v":"Isolation des conduites, gaines, vannes et accessoires d'une boucle de circulation d'eau chaude sanitaire"},{"$f":"'Guide & Calcul des primes'!C70","v":"Isolation échangeur externe"},{"$f":"'Guide & Calcul des primes'!C72","v":"Installation VMC centralisée - simple flux"},{"$f":"'Guide & Calcul des primes'!C73","v":"Installation VMC partielle - simple flux"},{"$f":"'Guide & Calcul des primes'!C74","v":"Installation VMC centralisée - double flux (avec récupération de chaleur)"},{"$f":"'Guide & Calcul des primes'!C75","v":"Installation VMC partielle - double flux"},{"$f":"'Guide & Calcul des primes'!C77","v":"Mise en conformité de l'installation électrique"},{"$f":"'Guide & Calcul des primes'!C78","v":"Mise en conformité de l'installation de gaz"},{"$f":"'Guide & Calcul des primes'!C80","v":"Élimination de mérule ou autre champignon aux effets analogues (traitements préventifs nons compris)"},{"$f":"'Guide & Calcul des primes'!C81","v":"Travaux de traitement / élimination de radon"},{"$f":"'Guide & Calcul des primes'!C82","v":"Mise en conformité de l’éclairage naturel"},{"$f":"'Guide & Calcul des primes'!C83","v":"Mise en conformité de la ventilation"},{"$f":"'Guide & Calcul des primes'!C84","v":"Mise en conformité de la hauteur sous plafond"},{"$f":"'Guide & Calcul des primes'!C85","v":"Remplacement d’un escalier intérieur"},{"$f":"'Guide & Calcul des primes'!C86","v":"Installation / mise en conformité d’une toilette"},{"$f":"'Guide & Calcul des primes'!C87","v":"Installation / mise en conformité d’un point d’eau potable sur un évier dans la cuisine"},{"$f":"'Guide & Calcul des primes'!C88","v":"Installation / mise en conformité d’une première salle d’eau"},{"$f":"'Guide & Calcul des primes'!C89","v":"Sécurisation de baies de fenêtres et de mezzanines"},{"$f":"'Guide & Calcul des primes'!C90","v":"Gainage de corps de cheminée, et/ou restauration, reconstruction ou démolition des souches existantes et/ou accessoires"},{"$f":"'Guide & Calcul des primes'!C91","v":"Installation d’un système d’égouttage des eaux usées"}]
[null,"Montant prime →",{"$f":"'Guide & Calcul des primes'!G26","v":380},{"$f":"'Guide & Calcul des primes'!G28","v":100},{"$f":"'Guide & Calcul des primes'!G29","v":130},{"$f":"'Guide & Calcul des primes'!G30","v":20},{"$f":"'Guide & Calcul des primes'!G31","v":500},{"$f":"'Guide & Calcul des primes'!G32","v":200},{"$f":"'Guide & Calcul des primes'!G33","v":""},{"$f":"'Guide & Calcul des primes'!G35","v":44},{"$f":"'Guide & Calcul des primes'!G36","v":60},{"$f":"'Guide & Calcul des primes'!G37","v":12},{"$f":"'Guide & Calcul des primes'!G38","v":16},{"$f":"'Guide & Calcul des primes'!G39","v":16},{"$f":"'Guide & Calcul des primes'!G41","v":30},{"$f":"'Guide & Calcul des primes'!G42","v":40},{"$f":"'Guide & Calcul des primes'!G43","v":10},{"$f":"'Guide & Calcul des primes'!G44","v":10},{"$f":"'Guide & Calcul des primes'!G45","v":700},{"$f":"'Guide & Calcul des primes'!G47","v":130},{"$f":"'Guide & Calcul des primes'!G49","v":1400},{"$f":"'Guide & Calcul des primes'!G50","v":3000},{"$f":"'Guide & Calcul des primes'!G51","v":3600},{"$f":"'Guide & Calcul des primes'!G52","v":800},{"$f":"'Guide & Calcul des primes'!G53","v":2100},{"$f":"'Guide & Calcul des primes'!G55","v":170},{"$f":"'Guide & Calcul des primes'!G56","v":70},{"$f":"'Guide & Calcul des primes'!G57","v":380},{"$f":"'Guide & Calcul des primes'!G58","v":100},{"$f":"'Guide & Calcul des primes'!G59","v":170},{"$f":"'Guide & Calcul des primes'!G60","v":200},{"$f":"'Guide & Calcul des primes'!G61","v":340},{"$f":"'Guide & Calcul des primes'!G62","v":20},{"$f":"'Guide & Calcul des primes'!G63","v":80},{"$f":"'Guide & Calcul des primes'!G65","v":100},{"$f":"'Guide & Calcul des primes'!G66","v":170},{"$f":"'Guide & Calcul des primes'!G67","v":240},{"$f":"'Guide & Calcul des primes'!G68","v":360},{"$f":"'Guide & Calcul des primes'!G69","v":100},{"$f":"'Guide & Calcul des primes'!G70","v":170},{"$f":"'Guide & Calcul des primes'!G72","v":1400},{"$f":"'Guide & Calcul des primes'!G73","v":400},{"$f":"'Guide & Calcul des primes'!G74","v":3400},{"$f":"'Guide & Calcul des primes'!G75","v":800},{"$f":"'Guide & Calcul des primes'!G77","v":1600},{"$f":"'Guide & Calcul des primes'!G78","v":700},{"$f":"'Guide & Calcul des primes'!G80","v":700},{"$f":"'Guide & Calcul des primes'!G81","v":700},{"$f":"'Guide & Calcul des primes'!G82","v":700},{"$f":"'Guide & Calcul des primes'!G83","v":700},{"$f":"'Guide & Calcul des primes'!G84","v":700},{"$f":"'Guide & Calcul des primes'!G85","v":700},{"$f":"'Guide & Calcul des primes'!G86","v":700},{"$f":"'Guide & Calcul des primes'!G87","v":700},{"$f":"'Guide & Calcul des primes'!G88","v":700},{"$f":"'Guide & Calcul des primes'!G89","v":700},{"$f":"'Guide & Calcul des primes'!G90","v":700},{"$f":"'Guide & Calcul des primes'!G91","v":700}]
[null,"Unité →",{"$f":"'Guide & Calcul des primes'!I26","v":"forfait"},{"$f":"'Guide & Calcul des primes'!I28","v":"m² toiture isolée"},{"$f":"'Guide & Calcul des primes'!I29","v":"m² toiture isolée"},{"$f":"'Guide & Calcul des primes'!I30","v":"m² toiture"},{"$f":"'Guide & Calcul des primes'!I31","v":"forfait"},{"$f":"'Guide & Calcul des primes'!I32","v":"forfait"},{"$f":"'Guide & Calcul des primes'!I33","v":0},{"$f":"'Guide & Calcul des primes'!I35","v":"m² mur isolé"},{"$f":"'Guide & Calcul des primes'!I36","v":"m² mur isolé"},{"$f":"'Guide & Calcul des primes'!I37","v":"m² mur asseché"},{"$f":"'Guide & Calcul des primes'!I38","v":"m mur"},{"$f":"'Guide & Calcul des primes'!I39","v":"m² mur instable"},{"$f":"'Guide & Calcul des primes'!I41","v":"m² sol isolé"},{"$f":"'Guide & Calcul des primes'!I42","v":"m² sol isolé"},{"$f":"'Guide & Calcul des primes'!I43","v":"m² sol"},{"$f":"'Guide & Calcul des primes'!I44","v":"m² sol isolé"},{"$f":"'Guide & Calcul des primes'!I45","v":"forfait"},{"$f":"'Guide & Calcul des primes'!I47","v":"m² châssis / vitrage"},{"$f":"'Guide & Calcul des primes'!I49","v":"forfait"},{"$f":"'Guide & Calcul des primes'!I50","v":"forfait"},{"$f":"'Guide & Calcul des primes'!I51","v":"forfait"},{"$f":"'Guide & Calcul des primes'!I52","v":"forfait"},{"$f":"'Guide & Calcul des primes'!I53","v":"forfait"},{"$f":"'Guide & Calcul des primes'!I55","v":"forfait"},{"$f":"'Guide & Calcul des primes'!I56","v":"circulateur"},{"$f":"'Guide & Calcul des primes'!I57","v":"circulateur"},{"$f":"'Guide & Calcul des primes'!I58","v":"forfait"},{"$f":"'Guide & Calcul des primes'!I59","v":"forfait"},{"$f":"'Guide & Calcul des primes'!I60","v":"forfait"},{"$f":"'Guide & Calcul des primes'!I61","v":"forfait"},{"$f":"'Guide & Calcul des primes'!I62","v":"vanne"},{"$f":"'Guide & Calcul des primes'!I63","v":"forfait"},{"$f":"'Guide & Calcul des primes'!I65","v":"forfait"},{"$f":"'Guide & Calcul des primes'!I66","v":"forfait"},{"$f":"'Guide & Calcul des primes'!I67","v":"forfait"},{"$f":"'Guide & Calcul des primes'!I68","v":"forfait"},{"$f":"'Guide & Calcul des primes'!I69","v":"forfait"},{"$f":"'Guide & Calcul des primes'!I70","v":"forfait"},{"$f":"'Guide & Calcul des primes'!I72","v":"forfait"},{"$f":"'Guide & Calcul des primes'!I73","v":"forfait"},{"$f":"'Guide & Calcul des primes'!I74","v":"forfait"},{"$f":"'Guide & Calcul des primes'!I75","v":"forfait"},{"$f":"'Guide & Calcul des primes'!I77","v":"forfait"},{"$f":"'Guide & Calcul des primes'!I78","v":"forfait"},{"$f":"'Guide & Calcul des primes'!I80","v":"forfait"},{"$f":"'Guide & Calcul des primes'!I81","v":"forfait"},{"$f":"'Guide & Calcul des primes'!I82","v":"forfait"},{"$f":"'Guide & Calcul des primes'!I83","v":"forfait"},{"$f":"'Guide & Calcul des primes'!I84","v":"forfait"},{"$f":"'Guide & Calcul des primes'!I85","v":"forfait"},{"$f":"'Guide & Calcul des primes'!I86","v":"forfait"},{"$f":"'Guide & Calcul des primes'!I87","v":"forfait"},{"$f":"'Guide & Calcul des primes'!I88","v":"forfait"},{"$f":"'Guide & Calcul des primes'!I89","v":"forfait"},{"$f":"'Guide & Calcul des primes'!I90","v":"forfait"},{"$f":"'Guide & Calcul des primes'!I91","v":"forfait"}]
[null,"Référence prime →","00.01","01.01","01.02","01.03","01.04","01.05","01.06","02.01","02.02","02.03","02.04","02.05","03.01","03.02","03.03","03.04","03.05","04.01","05.01","05.02","05.03","05.04","05.05","06.01","06.02","06.03","06.04","06.05","06.06","06.07","06.08","06.09","07.01","07.02","07.03","07.04","07.05","07.06","08.01","08.02","08.03","08.04","09.01","09.02","10.01","10.02","10.03","10.04","10.05","10.06","10.07","10.08","10.09","10.10","10.11","10.12"]
[null,null,"02.02","02.02","02.02","02.03","02.03","02.03","02.02",null,null,null,null,null,null,null,null,null,null,"06.02",null,null,null,null,null,null,null,null,null,null,null,null,null,null,null,null,null,null,null,null,null,null,"11.02","11.02","16.08"]
[null,null,"02.03","02.03","02.03",null,null,null,"02.03",null,null,null,null,null,null,null,null,null,null,"06.08"]
[null,null,"02.04","02.04","02.04",null,null,null,"02.04",null,null,null,null,null,null,null,null,null,null,"06.10"]
[null,null,"06.02"]
[null,null,"06.08"]
[null,null,"06.10"]
[null,null,"11.02"]
[null,null,"16.08"]